maven build fail for feature-aaa


George Zhao <George.Y.Zhao@...>
 

Hi

I don’t know if someone already filed a bug for this or not, when I tried to do a maven build from head, I got the following error.

 

It looks like something related to karaf.

 

 

[INFO] Reactor Summary:

[INFO]

[INFO] commons.aaa ....................................... SUCCESS [6.320s]

[INFO] aaa.project ....................................... SUCCESS [0.236s]

[INFO] aaa-authn-api ..................................... SUCCESS [6.825s]

[INFO] aaa-authn ......................................... SUCCESS [4.338s]

[INFO] aaa-authn-sts ..................................... SUCCESS [11.565s]

[INFO] aaa-authn-store ................................... SUCCESS [7.415s]

[INFO] aaa-authn-sssd .................................... SUCCESS [0.793s]

[INFO] aaa-authn-keystone ................................ SUCCESS [1.109s]

[INFO] aaa-idmlight ...................................... SUCCESS [0.946s]

[INFO] aaa-authz ......................................... SUCCESS [0.101s]

[INFO] aaa-authz-model ................................... SUCCESS [14.978s]

[INFO] features-aaa ...................................... FAILURE [2.203s]

[INFO] ------------------------------------------------------------------------

[INFO] BUILD FAILURE

[INFO] ------------------------------------------------------------------------

[INFO] Total time: 1:02.122s

[INFO] Finished at: Sat Aug 09 22:37:47 PDT 2014

[INFO] Final Memory: 52M/124M

[INFO] ------------------------------------------------------------------------

[ERROR] Failed to execute goal org.apache.karaf.tooling:karaf-maven-plugin:3.0.1:features-create-kar (features-create-kar) on project features-aaa: Failed to create archive: Could not find artifact org.opendaylight.aaa:features-aaa:cfg:clients:0.1.0-SNAPSHOT in opendaylight-release (http://nexus.opendaylight.org/content/repositories/opendaylight.release/)

[ERROR]

[ERROR] Try downloading the file manually from the project website.

[ERROR]

[ERROR] Then, install it using the command:

[ERROR] mvn install:install-file -DgroupId=org.opendaylight.aaa -DartifactId=features-aaa -Dversion=0.1.0-SNAPSHOT -Dclassifier=clients -Dpackaging=cfg -Dfile=/path/to/file

[ERROR]

[ERROR] Alternatively, if you host your own repository you can deploy the file there:

[ERROR] mvn deploy:deploy-file -DgroupId=org.opendaylight.aaa -DartifactId=features-aaa -Dversion=0.1.0-SNAPSHOT -Dclassifier=clients -Dpackaging=cfg -Dfile=/path/to/file -Durl=[url] -DrepositoryId=[id]

[ERROR]

[ERROR]

[ERROR] org.opendaylight.aaa:features-aaa:cfg:0.1.0-SNAPSHOT

[ERROR]


Nguyen, Liem Manh <liem_m_nguyen@...>
 

Hi Zhao,

 

This has been fixed a week or so ago…  Please pull the latest and let me know if it is still broken for you.

 

Hmm.. wonder why Jenkins did not catch it…  Will investigate….

 

Liem

 

From: aaa-dev-bounces@... [mailto:aaa-dev-bounces@...] On Behalf Of George Zhao
Sent: Saturday, August 09, 2014 10:43 PM
To: aaa-dev@...
Subject: [Aaa-dev] maven build fail for feature-aaa

 

Hi

I don’t know if someone already filed a bug for this or not, when I tried to do a maven build from head, I got the following error.

 

It looks like something related to karaf.

 

 

[INFO] Reactor Summary:

[INFO]

[INFO] commons.aaa ....................................... SUCCESS [6.320s]

[INFO] aaa.project ....................................... SUCCESS [0.236s]

[INFO] aaa-authn-api ..................................... SUCCESS [6.825s]

[INFO] aaa-authn ......................................... SUCCESS [4.338s]

[INFO] aaa-authn-sts ..................................... SUCCESS [11.565s]

[INFO] aaa-authn-store ................................... SUCCESS [7.415s]

[INFO] aaa-authn-sssd .................................... SUCCESS [0.793s]

[INFO] aaa-authn-keystone ................................ SUCCESS [1.109s]

[INFO] aaa-idmlight ...................................... SUCCESS [0.946s]

[INFO] aaa-authz ......................................... SUCCESS [0.101s]

[INFO] aaa-authz-model ................................... SUCCESS [14.978s]

[INFO] features-aaa ...................................... FAILURE [2.203s]

[INFO] ------------------------------------------------------------------------

[INFO] BUILD FAILURE

[INFO] ------------------------------------------------------------------------

[INFO] Total time: 1:02.122s

[INFO] Finished at: Sat Aug 09 22:37:47 PDT 2014

[INFO] Final Memory: 52M/124M

[INFO] ------------------------------------------------------------------------

[ERROR] Failed to execute goal org.apache.karaf.tooling:karaf-maven-plugin:3.0.1:features-create-kar (features-create-kar) on project features-aaa: Failed to create archive: Could not find artifact org.opendaylight.aaa:features-aaa:cfg:clients:0.1.0-SNAPSHOT in opendaylight-release (http://nexus.opendaylight.org/content/repositories/opendaylight.release/)

[ERROR]

[ERROR] Try downloading the file manually from the project website.

[ERROR]

[ERROR] Then, install it using the command:

[ERROR] mvn install:install-file -DgroupId=org.opendaylight.aaa -DartifactId=features-aaa -Dversion=0.1.0-SNAPSHOT -Dclassifier=clients -Dpackaging=cfg -Dfile=/path/to/file

[ERROR]

[ERROR] Alternatively, if you host your own repository you can deploy the file there:

[ERROR] mvn deploy:deploy-file -DgroupId=org.opendaylight.aaa -DartifactId=features-aaa -Dversion=0.1.0-SNAPSHOT -Dclassifier=clients -Dpackaging=cfg -Dfile=/path/to/file -Durl=[url] -DrepositoryId=[id]

[ERROR]

[ERROR]

[ERROR] org.opendaylight.aaa:features-aaa:cfg:0.1.0-SNAPSHOT

[ERROR]