why tsdr-artifact 1.5.0 not found error?


YuLing Chen <yulingchen54@...>
 

Dear integration and aaa members,

After tsdr being added back to autorelease, now I do not see the tsdr-artifact 1.5.0 not found issue. However, I'm hitting aaa 0.7.0-SNAPSHOT not found error in the build. Any idea?

07:15:53 [ERROR] Failed to execute goal on project features-index: Could not resolve dependencies for project org.opendaylight.integration:features-index:feature:0.8.0-SNAPSHOT: Could not find artifact org.opendaylight.aaa:odl-aaa-authn:xml:features:0.7.0-SNAPSHOT in opendaylight-snapshot (https://nexus.opendaylight.org/content/repositories/opendaylight.snapshot/) -> [Help 1]
07:15:53 [ERROR] 
07:15:53 [ERROR] To see the full stack trace of the errors, re-run Maven with the -e switch.

Jenkins build console:https://jenkins.opendaylight.org/releng/job/distribution-verify-oxygen/83/console

Thanks very much,

YuLing

On Wed, Nov 22, 2017 at 12:26 AM, YuLing Chen <yulingchen54@...> wrote:
Hi Jamo, Luis, and all integration experts:

I'm hitting an error in with following patch set and the console on the build server shows tsdr-artifact 1.5.0 not found.  


However, the following patch set from tsdr master should have generated tsdr-artifacts:


Any idea why the build failed but my local build was good? 

Thanks very much,

YuLing


Ryan Goulding <ryandgoulding@...>
 

You are going to want to use "features-aaa" instead of "odl-aaa-authn" in "features/odl-tsdr-restconf-collector/pom.xml"

Hope this helps.

Regards,
Ryan

On Mon, Dec 4, 2017 at 2:36 AM, YuLing Chen <yulingchen54@...> wrote:
Dear integration and aaa members,

After tsdr being added back to autorelease, now I do not see the tsdr-artifact 1.5.0 not found issue. However, I'm hitting aaa 0.7.0-SNAPSHOT not found error in the build. Any idea?

07:15:53 [ERROR] Failed to execute goal on project features-index: Could not resolve dependencies for project org.opendaylight.integration:features-index:feature:0.8.0-SNAPSHOT: Could not find artifact org.opendaylight.aaa:odl-aaa-authn:xml:features:0.7.0-SNAPSHOT in opendaylight-snapshot (https://nexus.opendaylight.org/content/repositories/opendaylight.snapshot/) -> [Help 1]
07:15:53 [ERROR] 
07:15:53 [ERROR] To see the full stack trace of the errors, re-run Maven with the -e switch.

Jenkins build console:https://jenkins.opendaylight.org/releng/job/distribution-verify-oxygen/83/console

Thanks very much,

YuLing

On Wed, Nov 22, 2017 at 12:26 AM, YuLing Chen <yulingchen54@...> wrote:
Hi Jamo, Luis, and all integration experts:

I'm hitting an error in with following patch set and the console on the build server shows tsdr-artifact 1.5.0 not found.  


However, the following patch set from tsdr master should have generated tsdr-artifacts:


Any idea why the build failed but my local build was good? 

Thanks very much,

YuLing


_______________________________________________
aaa-dev mailing list
aaa-dev@...
https://lists.opendaylight.org/mailman/listinfo/aaa-dev



Ryan Goulding <ryandgoulding@...>
 

We can watch this and see how it goes [0].

On Mon, Dec 4, 2017 at 9:26 AM, Ryan Goulding <ryandgoulding@...> wrote:
You are going to want to use "features-aaa" instead of "odl-aaa-authn" in "features/odl-tsdr-restconf-collector/pom.xml"

Hope this helps.

Regards,
Ryan

On Mon, Dec 4, 2017 at 2:36 AM, YuLing Chen <yulingchen54@...> wrote:
Dear integration and aaa members,

After tsdr being added back to autorelease, now I do not see the tsdr-artifact 1.5.0 not found issue. However, I'm hitting aaa 0.7.0-SNAPSHOT not found error in the build. Any idea?

07:15:53 [ERROR] Failed to execute goal on project features-index: Could not resolve dependencies for project org.opendaylight.integration:features-index:feature:0.8.0-SNAPSHOT: Could not find artifact org.opendaylight.aaa:odl-aaa-authn:xml:features:0.7.0-SNAPSHOT in opendaylight-snapshot (https://nexus.opendaylight.org/content/repositories/opendaylight.snapshot/) -> [Help 1]
07:15:53 [ERROR] 
07:15:53 [ERROR] To see the full stack trace of the errors, re-run Maven with the -e switch.

Jenkins build console:https://jenkins.opendaylight.org/releng/job/distribution-verify-oxygen/83/console

Thanks very much,

YuLing

On Wed, Nov 22, 2017 at 12:26 AM, YuLing Chen <yulingchen54@...> wrote:
Hi Jamo, Luis, and all integration experts:

I'm hitting an error in with following patch set and the console on the build server shows tsdr-artifact 1.5.0 not found.  


However, the following patch set from tsdr master should have generated tsdr-artifacts:


Any idea why the build failed but my local build was good? 

Thanks very much,

YuLing


_______________________________________________
aaa-dev mailing list
aaa-dev@...
https://lists.opendaylight.org/mailman/listinfo/aaa-dev




YuLing Chen <yulingchen54@...>
 

Thanks very much Ryan and Tom for the help and merge of the patch set!

BR,

YuLing

On Mon, Dec 4, 2017 at 6:27 AM, Ryan Goulding <ryandgoulding@...> wrote:
We can watch this and see how it goes [0].

Regards,

Ryan Goulding


On Mon, Dec 4, 2017 at 9:26 AM, Ryan Goulding <ryandgoulding@...> wrote:
You are going to want to use "features-aaa" instead of "odl-aaa-authn" in "features/odl-tsdr-restconf-collector/pom.xml"

Hope this helps.

Regards,
Ryan

On Mon, Dec 4, 2017 at 2:36 AM, YuLing Chen <yulingchen54@...> wrote:
Dear integration and aaa members,

After tsdr being added back to autorelease, now I do not see the tsdr-artifact 1.5.0 not found issue. However, I'm hitting aaa 0.7.0-SNAPSHOT not found error in the build. Any idea?

07:15:53 [ERROR] Failed to execute goal on project features-index: Could not resolve dependencies for project org.opendaylight.integration:features-index:feature:0.8.0-SNAPSHOT: Could not find artifact org.opendaylight.aaa:odl-aaa-authn:xml:features:0.7.0-SNAPSHOT in opendaylight-snapshot (https://nexus.opendaylight.org/content/repositories/opendaylight.snapshot/) -> [Help 1]
07:15:53 [ERROR] 
07:15:53 [ERROR] To see the full stack trace of the errors, re-run Maven with the -e switch.

Jenkins build console:https://jenkins.opendaylight.org/releng/job/distribution-verify-oxygen/83/console

Thanks very much,

YuLing

On Wed, Nov 22, 2017 at 12:26 AM, YuLing Chen <yulingchen54@...> wrote:
Hi Jamo, Luis, and all integration experts:

I'm hitting an error in with following patch set and the console on the build server shows tsdr-artifact 1.5.0 not found.  


However, the following patch set from tsdr master should have generated tsdr-artifacts:


Any idea why the build failed but my local build was good? 

Thanks very much,

YuLing


_______________________________________________
aaa-dev mailing list
aaa-dev@...
https://lists.opendaylight.org/mailman/listinfo/aaa-dev





Tom Pantelis
 



On Tue, Dec 5, 2017 at 5:12 PM, YuLing Chen <yulingchen54@...> wrote:
Thanks very much Ryan and Tom for the help and merge of the patch set

NP. I also pushed patches to fix checkstyle violations and enable enforcement. (I took the liberty of self-merging as they were quite large and mechanical - hppe that's OK :)) I'm working on FindBugs fixes now and have some other cleanup/improvements that I'll get to when I can (YuLing - I'll add you as reviewer on those).   


Tom Pantelis
 

And thanks to Ryan for pushing that patch.

On Tue, Dec 5, 2017 at 6:26 PM, Tom Pantelis <tompantelis@...> wrote:


On Tue, Dec 5, 2017 at 5:12 PM, YuLing Chen <yulingchen54@...> wrote:
Thanks very much Ryan and Tom for the help and merge of the patch set

NP. I also pushed patches to fix checkstyle violations and enable enforcement. (I took the liberty of self-merging as they were quite large and mechanical - hppe that's OK :)) I'm working on FindBugs fixes now and have some other cleanup/improvements that I'll get to when I can (YuLing - I'll add you as reviewer on those).