[release] Autorelease sodium-mvn35-openjdk11 failed to build metrics-api from infrautils


Jenkins <jenkins-dontreply@...>
 

Attention infrautils-devs,

Autorelease sodium-mvn35-openjdk11 failed to build metrics-api from infrautils in build
91. Attached is a snippet of the error message related to the
failure that we were able to automatically parse as well as console logs.


Console Logs:
https://logs.opendaylight.org/releng/vex-yul-odl-jenkins-1/autorelease-release-sodium-mvn35-openjdk11/91

Jenkins Build:
https://jenkins.opendaylight.org/releng/job/autorelease-release-sodium-mvn35-openjdk11/91/

Please review and provide an ETA on when a fix will be available.

Thanks,
ODL releng/autorelease team


Michael Vorburger
 

On Tue, Apr 30, 2019 at 3:54 AM Jenkins <jenkins-dontreply@...> wrote:
Attention infrautils-devs,

Autorelease sodium-mvn35-openjdk11 failed to build metrics-api from infrautils in build
91. Attached is a snippet of the error message related to the
failure that we were able to automatically parse as well as console logs.


Console Logs:
https://logs.opendaylight.org/releng/vex-yul-odl-jenkins-1/autorelease-release-sodium-mvn35-openjdk11/91

Jenkins Build:
https://jenkins.opendaylight.org/releng/job/autorelease-release-sodium-mvn35-openjdk11/91/

Please review and provide an ETA on when a fix will be available.
 
[ERROR] Failed to execute goal org.apache.maven.plugins:maven-javadoc-plugin:3.1.0:jar (attach-javadocs) on project metrics-api: MavenReportException: Error while generating Javadoc: 
[ERROR] Exit code: 1 - /w/workspace/autorelease-release-sodium-mvn35-openjdk11/infrautils/metrics/api/src/main/java/org/opendaylight/infrautils/metrics/Counter.java:15: error: tag not supported in the generated HTML version: tt
[ERROR]  * <p>Note that if you find you only use its <tt>increase()</tt> and never <tt>decrease()</tt>

and the same error in many other places... To fix this, apparently someone would just need to a global search & replace all <tt>bla bla</tt> with <code>bla bla</code> - who is up for doing that, and raising a Gerrit?

Thanks,
ODL releng/autorelease team

_______________________________________________
infrautils-dev mailing list
infrautils-dev@...
https://lists.opendaylight.org/mailman/listinfo/infrautils-dev


Stephen Kitt <skitt@...>
 

On Tue, Apr 30, 2019 at 01:34:57PM +0200, Michael Vorburger wrote:
[ERROR] Failed to execute goal
org.apache.maven.plugins:maven-javadoc-plugin:3.1.0:jar
(attach-javadocs) on project metrics-api: MavenReportException: Error
while generating Javadoc: [ERROR] Exit code: 1 -
/w/workspace/autorelease-release-sodium-mvn35-openjdk11/infrautils/metrics/api/src/main/java/org/opendaylight/infrautils/metrics/Counter.java:15:
error: tag not supported in the generated HTML version: tt[ERROR] *
<p>Note that if you find you only use its <tt>increase()</tt> and
never <tt>decrease()</tt>


and the same error in many other places... To fix this, apparently someone
would just need to a global search & replace all <tt>bla bla</tt> with
<code>bla bla</code> - who is up for doing that, and raising a Gerrit?
https://git.opendaylight.org/gerrit/81830

Regards,

Stephen