LISPMAP-175 lispflowmapping build failure in proposed topic:neon-mri ("Weather Item" TSC-132)


Michael Vorburger <vorburger@...>
 

Hi Lori,


If this was because in neutron the odlparent version was still  odlparent 4.0.1 4.0.2 (NEUTRON-197), then FYI this is meanwhile solved.
[INFO] --- maven-surefire-plugin:2.22.0:test (default) @ odl-lispflowmapping-neutron ---
[INFO] Surefire report directory: /w/workspace/integration-multipatch-test-neon/patch_tester/lispflowmapping/features/odl-lispflowmapping-neutron/target/surefire-reports
[INFO] 
[INFO] -------------------------------------------------------
[INFO]  T E S T S
[INFO] -------------------------------------------------------
[INFO] Running org.opendaylight.odlparent.featuretest.SingleFeatureTest
[ERROR] Tests run: 1, Failures: 0, Errors: 1, Skipped: 0, Time elapsed: 336.926 s <<< FAILURE! - in org.opendaylight.odlparent.featuretest.SingleFeatureTest
[ERROR] installFeatureCatchAndLog(org.opendaylight.odlparent.featuretest.SingleFeatureTest)[repoUrl: file:/w/workspace/integration-multipatch-test-neon/patch_tester/lispflowmapping/features/odl-lispflowmapping-neutron/target/feature/feature.xml, Feature: odl-lispflowmapping-neutron 1.9.0.SNAPSHOT]  Time elapsed: 333.516 s  <<< ERROR!
org.opendaylight.odlparent.bundlestest.lib.SystemStateFailureException: 
diag failed; some bundles failed to start
diag: Failure {Installed=0, Resolved=5, Unknown=0, GracePeriod=1, Waiting=0, Starting=0, Active=426, Stopping=0, Failure=1}
1. NOK org.opendaylight.lispflowmapping.mappingservice.implementation:1.9.0.SNAPSHOT: OSGi state = Active, Karaf bundleState = GracePeriod, due to: Blueprint
10/6/18 5:42 PM
Missing dependencies: 
Available DOM RPC for binding RPC: interface org.opendaylight.yang.gen.v1.urn.opendaylight.lfm.lisp.sb.rev150904.OdlLispSbService 
Declarative Services

2. NOK org.opendaylight.lispflowmapping.mappingservice.neutron:1.9.0.SNAPSHOT: OSGi state = Active, Karaf bundleState = Failure, due to: Blueprint
10/6/18 5:47 PM
Exception: 
null
java.util.concurrent.TimeoutException
	at org.apache.aries.blueprint.container.BlueprintContainerImpl$1.run(BlueprintContainerImpl.java:373)
	at org.apache.aries.blueprint.utils.threading.impl.DiscardableRunnable.run(DiscardableRunnable.java:45)
	at java.util.concurrent.Executors$RunnableAdapter.call(Executors.java:511)
	at java.util.concurrent.FutureTask.run(FutureTask.java:266)
	at java.util.concurrent.ScheduledThreadPoolExecutor$ScheduledFutureTask.access$201(ScheduledThreadPoolExecutor.java:180)
	at java.util.concurrent.ScheduledThreadPoolExecutor$ScheduledFutureTask.run(ScheduledThreadPoolExecutor.java:293)
	at java.util.concurrent.ThreadPoolExecutor.runWorker(ThreadPoolExecutor.java:1149)
	at java.util.concurrent.ThreadPoolExecutor$Worker.run(ThreadPoolExecutor.java:624)
	at java.lang.Thread.run(Thread.java:748)

Missing dependencies: 
(objectClass=org.opendaylight.lispflowmapping.interfaces.lisp.IFlowMapping) Available DOM RPC for binding RPC: interface org.opendaylight.yang.gen.v1.urn.opendaylight.lfm.mappingservice.rev150906.OdlMappingserviceService 
Declarative Services

	at org.opendaylight.odlparent.bundlestest.lib.TestBundleDiag.checkBundleDiagInfos(TestBundleDiag.java:82)
	at org.opendaylight.odlparent.bundlestest.lib.TestBundleDiag.checkBundleDiagInfos(TestBundleDiag.java:56)
	at org.opendaylight.odlparent.featuretest.SingleFeatureTest.installFeature(SingleFeatureTest.java:410)
	at org.opendaylight.odlparent.featuretest.SingleFeatureTest.installFeatureCatchAndLog(SingleFeatureTest.java:361)
	at sun.reflect.NativeMethodAccessorImpl.invoke0(Native Method)
	at sun.reflect.NativeMethodAccessorImpl.invoke(NativeMethodAccessorImpl.java:62)
	at sun.reflect.DelegatingMethodAccessorImpl.invoke(DelegatingMethodAccessorImpl.java:43)
	at java.lang.reflect.Method.invoke(Method.java:498)
	at org.junit.runners.model.FrameworkMethod$1.runReflectiveCall(FrameworkMethod.java:50)
	at org.junit.internal.runners.model.ReflectiveCallable.run(ReflectiveCallable.java:12)
	at org.junit.runners.model.FrameworkMethod.invokeExplosively(FrameworkMethod.java:47)
	at org.junit.internal.runners.statements.InvokeMethod.evaluate(InvokeMethod.java:17)
	at org.junit.internal.runners.statements.FailOnTimeout$CallableStatement.call(FailOnTimeout.java:298)
	at org.junit.internal.runners.statements.FailOnTimeout$CallableStatement.call(FailOnTimeout.java:292)
	at java.util.concurrent.FutureTask.run(FutureTask.java:266)
	at java.lang.Thread.run(Thread.java:748)

[INFO] 
[INFO] Results:
[INFO] 
[ERROR] Errors: 
[ERROR]   diag failed; some bundles failed to start
diag: Failure {Installed=0, Resolved=5, Unknown=0, GracePeriod=1, Waiting=0, Starting=0, Active=426, Stopping=0, Failure=1}
1. NOK org.opendaylight.lispflowmapping.mappingservice.implementation:1.9.0.SNAPSHOT: OSGi state = Active, Karaf bundleState = GracePeriod, due to: Blueprint
10/6/18 5:42 PM
Missing dependencies: 
Available DOM RPC for binding RPC: interface org.opendaylight.yang.gen.v1.urn.opendaylight.lfm.lisp.sb.rev150904.OdlLispSbService 
Declarative Services

2. NOK org.opendaylight.lispflowmapping.mappingservice.neutron:1.9.0.SNAPSHOT: OSGi state = Active, Karaf bundleState = Failure, due to: Blueprint
10/6/18 5:47 PM
Exception: 
null
java.util.concurrent.TimeoutException
	at org.apache.aries.blueprint.container.BlueprintContainerImpl$1.run(BlueprintContainerImpl.java:373)
	at org.apache.aries.blueprint.utils.threading.impl.DiscardableRunnable.run(DiscardableRunnable.java:45)
	at java.util.concurrent.Executors$RunnableAdapter.call(Executors.java:511)
	at java.util.concurrent.FutureTask.run(FutureTask.java:266)
	at java.util.concurrent.ScheduledThreadPoolExecutor$ScheduledFutureTask.access$201(ScheduledThreadPoolExecutor.java:180)
	at java.util.concurrent.ScheduledThreadPoolExecutor$ScheduledFutureTask.run(ScheduledThreadPoolExecutor.java:293)
	at java.util.concurrent.ThreadPoolExecutor.runWorker(ThreadPoolExecutor.java:1149)
	at java.util.concurrent.ThreadPoolExecutor$Worker.run(ThreadPoolExecutor.java:624)
	at java.lang.Thread.run(Thread.java:748)

Missing dependencies: 
(objectClass=org.opendaylight.lispflowmapping.interfaces.lisp.IFlowMapping) Available DOM RPC for binding RPC: interface org.opendaylight.yang.gen.v1.urn.opendaylight.lfm.mappingservice.rev150906.OdlMappingserviceService 
Declarative Services

[INFO] 
[ERROR] Tests run: 1, Failures: 0, Errors: 1, Skipped: 0
Tx,
M.
--
Michael Vorburger, Red Hat
vorburger@... | IRC: vorburger @freenode | ~ = http://vorburger.ch


Lori Jakab <lorand.jakab@...>
 

Hi,

I believe this was due to us not being upgraded to the released
version of MD-SAL 3.0.0. I just pushed patch set 13, which fixes this.
I usually test locally by building controller, aaa, netconf and
neutron in this order with -Pq, and then lispflowmapping without -Pq.
I just tested a build, manually upgrading neutron to mdsal 3.0.0 too
(which I see now you fixed), and it passed, including all unit and
integration test. I hope we should be good now.

-Lori

On Sat, Oct 6, 2018 at 9:16 PM Michael Vorburger <vorburger@...> wrote:

Hi Lori,

FYI https://logs.opendaylight.org/releng/vex-yul-odl-jenkins-1/integration-multipatch-test-neon/55/console.log.gz just failed on lispflowmapping.

If this was because in neutron the odlparent version was still odlparent 4.0.1 4.0.2 (NEUTRON-197), then FYI this is meanwhile solved.

[INFO] --- maven-surefire-plugin:2.22.0:test (default) @ odl-lispflowmapping-neutron ---
[INFO] Surefire report directory: /w/workspace/integration-multipatch-test-neon/patch_tester/lispflowmapping/features/odl-lispflowmapping-neutron/target/surefire-reports
[INFO]
[INFO] -------------------------------------------------------
[INFO] T E S T S
[INFO] -------------------------------------------------------
[INFO] Running org.opendaylight.odlparent.featuretest.SingleFeatureTest
[ERROR] Tests run: 1, Failures: 0, Errors: 1, Skipped: 0, Time elapsed: 336.926 s <<< FAILURE! - in org.opendaylight.odlparent.featuretest.SingleFeatureTest
[ERROR] installFeatureCatchAndLog(org.opendaylight.odlparent.featuretest.SingleFeatureTest)[repoUrl: file:/w/workspace/integration-multipatch-test-neon/patch_tester/lispflowmapping/features/odl-lispflowmapping-neutron/target/feature/feature.xml, Feature: odl-lispflowmapping-neutron 1.9.0.SNAPSHOT] Time elapsed: 333.516 s <<< ERROR!
org.opendaylight.odlparent.bundlestest.lib.SystemStateFailureException:
diag failed; some bundles failed to start
diag: Failure {Installed=0, Resolved=5, Unknown=0, GracePeriod=1, Waiting=0, Starting=0, Active=426, Stopping=0, Failure=1}
1. NOK org.opendaylight.lispflowmapping.mappingservice.implementation:1.9.0.SNAPSHOT: OSGi state = Active, Karaf bundleState = GracePeriod, due to: Blueprint
10/6/18 5:42 PM
Missing dependencies:
Available DOM RPC for binding RPC: interface org.opendaylight.yang.gen.v1.urn.opendaylight.lfm.lisp.sb.rev150904.OdlLispSbService
Declarative Services

2. NOK org.opendaylight.lispflowmapping.mappingservice.neutron:1.9.0.SNAPSHOT: OSGi state = Active, Karaf bundleState = Failure, due to: Blueprint
10/6/18 5:47 PM
Exception:
null
java.util.concurrent.TimeoutException
at org.apache.aries.blueprint.container.BlueprintContainerImpl$1.run(BlueprintContainerImpl.java:373)
at org.apache.aries.blueprint.utils.threading.impl.DiscardableRunnable.run(DiscardableRunnable.java:45)
at java.util.concurrent.Executors$RunnableAdapter.call(Executors.java:511)
at java.util.concurrent.FutureTask.run(FutureTask.java:266)
at java.util.concurrent.ScheduledThreadPoolExecutor$ScheduledFutureTask.access$201(ScheduledThreadPoolExecutor.java:180)
at java.util.concurrent.ScheduledThreadPoolExecutor$ScheduledFutureTask.run(ScheduledThreadPoolExecutor.java:293)
at java.util.concurrent.ThreadPoolExecutor.runWorker(ThreadPoolExecutor.java:1149)
at java.util.concurrent.ThreadPoolExecutor$Worker.run(ThreadPoolExecutor.java:624)
at java.lang.Thread.run(Thread.java:748)

Missing dependencies:
(objectClass=org.opendaylight.lispflowmapping.interfaces.lisp.IFlowMapping) Available DOM RPC for binding RPC: interface org.opendaylight.yang.gen.v1.urn.opendaylight.lfm.mappingservice.rev150906.OdlMappingserviceService
Declarative Services

at org.opendaylight.odlparent.bundlestest.lib.TestBundleDiag.checkBundleDiagInfos(TestBundleDiag.java:82)
at org.opendaylight.odlparent.bundlestest.lib.TestBundleDiag.checkBundleDiagInfos(TestBundleDiag.java:56)
at org.opendaylight.odlparent.featuretest.SingleFeatureTest.installFeature(SingleFeatureTest.java:410)
at org.opendaylight.odlparent.featuretest.SingleFeatureTest.installFeatureCatchAndLog(SingleFeatureTest.java:361)
at sun.reflect.NativeMethodAccessorImpl.invoke0(Native Method)
at sun.reflect.NativeMethodAccessorImpl.invoke(NativeMethodAccessorImpl.java:62)
at sun.reflect.DelegatingMethodAccessorImpl.invoke(DelegatingMethodAccessorImpl.java:43)
at java.lang.reflect.Method.invoke(Method.java:498)
at org.junit.runners.model.FrameworkMethod$1.runReflectiveCall(FrameworkMethod.java:50)
at org.junit.internal.runners.model.ReflectiveCallable.run(ReflectiveCallable.java:12)
at org.junit.runners.model.FrameworkMethod.invokeExplosively(FrameworkMethod.java:47)
at org.junit.internal.runners.statements.InvokeMethod.evaluate(InvokeMethod.java:17)
at org.junit.internal.runners.statements.FailOnTimeout$CallableStatement.call(FailOnTimeout.java:298)
at org.junit.internal.runners.statements.FailOnTimeout$CallableStatement.call(FailOnTimeout.java:292)
at java.util.concurrent.FutureTask.run(FutureTask.java:266)
at java.lang.Thread.run(Thread.java:748)

[INFO]
[INFO] Results:
[INFO]
[ERROR] Errors:
[ERROR] diag failed; some bundles failed to start
diag: Failure {Installed=0, Resolved=5, Unknown=0, GracePeriod=1, Waiting=0, Starting=0, Active=426, Stopping=0, Failure=1}
1. NOK org.opendaylight.lispflowmapping.mappingservice.implementation:1.9.0.SNAPSHOT: OSGi state = Active, Karaf bundleState = GracePeriod, due to: Blueprint
10/6/18 5:42 PM
Missing dependencies:
Available DOM RPC for binding RPC: interface org.opendaylight.yang.gen.v1.urn.opendaylight.lfm.lisp.sb.rev150904.OdlLispSbService
Declarative Services

2. NOK org.opendaylight.lispflowmapping.mappingservice.neutron:1.9.0.SNAPSHOT: OSGi state = Active, Karaf bundleState = Failure, due to: Blueprint
10/6/18 5:47 PM
Exception:
null
java.util.concurrent.TimeoutException
at org.apache.aries.blueprint.container.BlueprintContainerImpl$1.run(BlueprintContainerImpl.java:373)
at org.apache.aries.blueprint.utils.threading.impl.DiscardableRunnable.run(DiscardableRunnable.java:45)
at java.util.concurrent.Executors$RunnableAdapter.call(Executors.java:511)
at java.util.concurrent.FutureTask.run(FutureTask.java:266)
at java.util.concurrent.ScheduledThreadPoolExecutor$ScheduledFutureTask.access$201(ScheduledThreadPoolExecutor.java:180)
at java.util.concurrent.ScheduledThreadPoolExecutor$ScheduledFutureTask.run(ScheduledThreadPoolExecutor.java:293)
at java.util.concurrent.ThreadPoolExecutor.runWorker(ThreadPoolExecutor.java:1149)
at java.util.concurrent.ThreadPoolExecutor$Worker.run(ThreadPoolExecutor.java:624)
at java.lang.Thread.run(Thread.java:748)

Missing dependencies:
(objectClass=org.opendaylight.lispflowmapping.interfaces.lisp.IFlowMapping) Available DOM RPC for binding RPC: interface org.opendaylight.yang.gen.v1.urn.opendaylight.lfm.mappingservice.rev150906.OdlMappingserviceService
Declarative Services

[INFO]
[ERROR] Tests run: 1, Failures: 0, Errors: 1, Skipped: 0

Tx,
M.
--
Michael Vorburger, Red Hat
vorburger@... | IRC: vorburger @freenode | ~ = http://vorburger.ch


Michael Vorburger <vorburger@...>
 

On Sun, Oct 7, 2018 at 12:28 AM Lori Jakab <lorand.jakab@...> wrote:
Hi,

I believe this was due to us not being upgraded to the released
version of MD-SAL 3.0.0. I just pushed patch set 13, which fixes this.
 
TX, very helpful, yes this was it; I now have it running locally as well. 

I usually test locally by building controller, aaa, netconf and
neutron in this order with -Pq, and then lispflowmapping without -Pq.
I just tested a build, manually upgrading neutron to mdsal 3.0.0 too
(which I see now you fixed), and it passed, including all unit and
integration test. I hope we should be good now.
 

I'm also keeping https://jira.opendaylight.org/browse/TSC-132 up to date.

-Lori
On Sat, Oct 6, 2018 at 9:16 PM Michael Vorburger <vorburger@...> wrote:
>
> Hi Lori,
>
> FYI https://logs.opendaylight.org/releng/vex-yul-odl-jenkins-1/integration-multipatch-test-neon/55/console.log.gz just failed on lispflowmapping.
>
> If this was because in neutron the odlparent version was still  odlparent 4.0.1 4.0.2 (NEUTRON-197), then FYI this is meanwhile solved.
>
> [INFO] --- maven-surefire-plugin:2.22.0:test (default) @ odl-lispflowmapping-neutron ---
> [INFO] Surefire report directory: /w/workspace/integration-multipatch-test-neon/patch_tester/lispflowmapping/features/odl-lispflowmapping-neutron/target/surefire-reports
> [INFO]
> [INFO] -------------------------------------------------------
> [INFO]  T E S T S
> [INFO] -------------------------------------------------------
> [INFO] Running org.opendaylight.odlparent.featuretest.SingleFeatureTest
> [ERROR] Tests run: 1, Failures: 0, Errors: 1, Skipped: 0, Time elapsed: 336.926 s <<< FAILURE! - in org.opendaylight.odlparent.featuretest.SingleFeatureTest
> [ERROR] installFeatureCatchAndLog(org.opendaylight.odlparent.featuretest.SingleFeatureTest)[repoUrl: file:/w/workspace/integration-multipatch-test-neon/patch_tester/lispflowmapping/features/odl-lispflowmapping-neutron/target/feature/feature.xml, Feature: odl-lispflowmapping-neutron 1.9.0.SNAPSHOT]  Time elapsed: 333.516 s  <<< ERROR!
> org.opendaylight.odlparent.bundlestest.lib.SystemStateFailureException:
> diag failed; some bundles failed to start
> diag: Failure {Installed=0, Resolved=5, Unknown=0, GracePeriod=1, Waiting=0, Starting=0, Active=426, Stopping=0, Failure=1}
> 1. NOK org.opendaylight.lispflowmapping.mappingservice.implementation:1.9.0.SNAPSHOT: OSGi state = Active, Karaf bundleState = GracePeriod, due to: Blueprint
> 10/6/18 5:42 PM
> Missing dependencies:
> Available DOM RPC for binding RPC: interface org.opendaylight.yang.gen.v1.urn.opendaylight.lfm.lisp.sb.rev150904.OdlLispSbService
> Declarative Services
>
> 2. NOK org.opendaylight.lispflowmapping.mappingservice.neutron:1.9.0.SNAPSHOT: OSGi state = Active, Karaf bundleState = Failure, due to: Blueprint
> 10/6/18 5:47 PM
> Exception:
> null
> java.util.concurrent.TimeoutException
> at org.apache.aries.blueprint.container.BlueprintContainerImpl$1.run(BlueprintContainerImpl.java:373)
> at org.apache.aries.blueprint.utils.threading.impl.DiscardableRunnable.run(DiscardableRunnable.java:45)
> at java.util.concurrent.Executors$RunnableAdapter.call(Executors.java:511)
> at java.util.concurrent.FutureTask.run(FutureTask.java:266)
> at java.util.concurrent.ScheduledThreadPoolExecutor$ScheduledFutureTask.access$201(ScheduledThreadPoolExecutor.java:180)
> at java.util.concurrent.ScheduledThreadPoolExecutor$ScheduledFutureTask.run(ScheduledThreadPoolExecutor.java:293)
> at java.util.concurrent.ThreadPoolExecutor.runWorker(ThreadPoolExecutor.java:1149)
> at java.util.concurrent.ThreadPoolExecutor$Worker.run(ThreadPoolExecutor.java:624)
> at java.lang.Thread.run(Thread.java:748)
>
> Missing dependencies:
> (objectClass=org.opendaylight.lispflowmapping.interfaces.lisp.IFlowMapping) Available DOM RPC for binding RPC: interface org.opendaylight.yang.gen.v1.urn.opendaylight.lfm.mappingservice.rev150906.OdlMappingserviceService
> Declarative Services
>
> at org.opendaylight.odlparent.bundlestest.lib.TestBundleDiag.checkBundleDiagInfos(TestBundleDiag.java:82)
> at org.opendaylight.odlparent.bundlestest.lib.TestBundleDiag.checkBundleDiagInfos(TestBundleDiag.java:56)
> at org.opendaylight.odlparent.featuretest.SingleFeatureTest.installFeature(SingleFeatureTest.java:410)
> at org.opendaylight.odlparent.featuretest.SingleFeatureTest.installFeatureCatchAndLog(SingleFeatureTest.java:361)
> at sun.reflect.NativeMethodAccessorImpl.invoke0(Native Method)
> at sun.reflect.NativeMethodAccessorImpl.invoke(NativeMethodAccessorImpl.java:62)
> at sun.reflect.DelegatingMethodAccessorImpl.invoke(DelegatingMethodAccessorImpl.java:43)
> at java.lang.reflect.Method.invoke(Method.java:498)
> at org.junit.runners.model.FrameworkMethod$1.runReflectiveCall(FrameworkMethod.java:50)
> at org.junit.internal.runners.model.ReflectiveCallable.run(ReflectiveCallable.java:12)
> at org.junit.runners.model.FrameworkMethod.invokeExplosively(FrameworkMethod.java:47)
> at org.junit.internal.runners.statements.InvokeMethod.evaluate(InvokeMethod.java:17)
> at org.junit.internal.runners.statements.FailOnTimeout$CallableStatement.call(FailOnTimeout.java:298)
> at org.junit.internal.runners.statements.FailOnTimeout$CallableStatement.call(FailOnTimeout.java:292)
> at java.util.concurrent.FutureTask.run(FutureTask.java:266)
> at java.lang.Thread.run(Thread.java:748)
>
> [INFO]
> [INFO] Results:
> [INFO]
> [ERROR] Errors:
> [ERROR]   diag failed; some bundles failed to start
> diag: Failure {Installed=0, Resolved=5, Unknown=0, GracePeriod=1, Waiting=0, Starting=0, Active=426, Stopping=0, Failure=1}
> 1. NOK org.opendaylight.lispflowmapping.mappingservice.implementation:1.9.0.SNAPSHOT: OSGi state = Active, Karaf bundleState = GracePeriod, due to: Blueprint
> 10/6/18 5:42 PM
> Missing dependencies:
> Available DOM RPC for binding RPC: interface org.opendaylight.yang.gen.v1.urn.opendaylight.lfm.lisp.sb.rev150904.OdlLispSbService
> Declarative Services
>
> 2. NOK org.opendaylight.lispflowmapping.mappingservice.neutron:1.9.0.SNAPSHOT: OSGi state = Active, Karaf bundleState = Failure, due to: Blueprint
> 10/6/18 5:47 PM
> Exception:
> null
> java.util.concurrent.TimeoutException
> at org.apache.aries.blueprint.container.BlueprintContainerImpl$1.run(BlueprintContainerImpl.java:373)
> at org.apache.aries.blueprint.utils.threading.impl.DiscardableRunnable.run(DiscardableRunnable.java:45)
> at java.util.concurrent.Executors$RunnableAdapter.call(Executors.java:511)
> at java.util.concurrent.FutureTask.run(FutureTask.java:266)
> at java.util.concurrent.ScheduledThreadPoolExecutor$ScheduledFutureTask.access$201(ScheduledThreadPoolExecutor.java:180)
> at java.util.concurrent.ScheduledThreadPoolExecutor$ScheduledFutureTask.run(ScheduledThreadPoolExecutor.java:293)
> at java.util.concurrent.ThreadPoolExecutor.runWorker(ThreadPoolExecutor.java:1149)
> at java.util.concurrent.ThreadPoolExecutor$Worker.run(ThreadPoolExecutor.java:624)
> at java.lang.Thread.run(Thread.java:748)
>
> Missing dependencies:
> (objectClass=org.opendaylight.lispflowmapping.interfaces.lisp.IFlowMapping) Available DOM RPC for binding RPC: interface org.opendaylight.yang.gen.v1.urn.opendaylight.lfm.mappingservice.rev150906.OdlMappingserviceService
> Declarative Services
>
> [INFO]
> [ERROR] Tests run: 1, Failures: 0, Errors: 1, Skipped: 0
>
> Tx,
> M.
> --
> Michael Vorburger, Red Hat
> vorburger@... | IRC: vorburger @freenode | ~ = http://vorburger.ch